{"text_format":"1","workbook":"xlsx","n_sheets":2,"sheets":["FORMATO","LISTAS"],"not_rendered":{"charts":0,"images":1,"macros":1,"external_links":1,"defined_names":103,"comments":0,"pivot_tables":0},"unopened":[],"bounds":{"document_bytes":16777216,"sheet_cells":100000,"rows_first":2000,"rows_last":500,"rows_between":2000,"halvings":0,"cell_chars":16384,"cell_head_chars":4096},"cells_cut":0,"cells_raw":0,"read":"whole","date_system":"1900"}

{"sheet":"FORMATO","index":0,"n_rows":510,"n_cols":50,"rows_kept":510,"cut":false,"hidden":false,"merged":[[22,0,23,0],[22,45,23,45],[8,3,8,5],[0,0,2,1],[0,2,2,10],[22,6,23,6],[0,11,0,12],[1,11,1,12],[2,11,2,12],[12,3,12,11],[17,7,20,10],[4,4,6,11],[20,3,20,4],[17,3,17,4],[18,3,18,4],[19,3,19,4],[10,3,10,11],[20,48,21,49],[21,23,21,24],[21,25,21,26],[21,27,21,28],[21,45,21,46],[21,33,21,34],[21,35,21,36],[21,37,21,38],[21,39,21,40],[21,41,21,42],[21,43,21,44],[20,23,20,46],[21,29,21,30],[21,31,21,32],[22,46,23,46],[22,16,23,16],[22,17,23,17],[22,18,23,18],[22,19,23,19],[22,20,23,20],[22,28,23,28],[22,29,23,29],[22,30,23,30],[22,21,23,21],[22,22,23,22],[22,23,23,23],[22,24,23,24],[22,25,23,25],[22,26,23,26],[22,27,23,27],[22,48,23,48],[22,49,23,49],[22,31,23,31],[22,32,23,32],[22,37,23,37],[22,38,23,38],[22,39,23,39],[22,40,23,40],[22,41,23,41],[22,33,23,33],[22,34,23,34],[22,35,23,35],[22,36,23,36],[22,42,23,42],[22,43,23,43],[22,44,23,44],[22,1,23,1],[22,2,23,2],[22,3,23,3],[22,4,23,4],[22,14,23,14],[22,15,23,15],[22,5,23,5],[22,7,23,7],[22,8,23,8],[22,9,23,9],[22,10,23,10],[22,11,22,12],[22,13,23,13]]}
["                                  ",null,"FORMATO\nFORMULACIÓN DE PLAN ANUAL DE ADQUISICIONES  ",null,null,null,null,null,null,null,null,"Código: F-DE-04"]
[null,null,null,null,null,null,null,null,null,null,null,"Fecha: 28/10/2024"]
[null,null,null,null,null,null,null,null,null,null,null,"Versión: 4"]
[]
[null,null,"Vigencia",2024]
[]
[null,null,"Rubro"]
[]
[null,null,"Dependencia Responsable"]
[]
[null,null,"Nombre del proyecto de inversión",{"$f":"IFERROR(IF($D$7=\"Funcionamiento\",\"N.A\",(VLOOKUP($D$9,LISTAS!$A$44:$E$53,2,0))),\"\")","v":""}]
[]
[null,null,"Objetivo General del Proyecto",{"$f":"IFERROR(IF($D$7=\"Funcionamiento\",\"N.A\",(VLOOKUP($D$9,LISTAS!$A$44:$E$53,3,0))),\"\")","v":""}]
[]
[null,null,"Código Presupuestal",{"$f":"IFERROR(IF($D$7=\"Funcionamiento\",\"N.A\",(VLOOKUP($D$9,LISTAS!$A$44:$E$53,4,0))),\"\")","v":""}]
[]
[]
[null,null,"DETALLE VALORES","VALOR TOTAL ESTIMADO VIGENCIA ACTUAL",null,null,null,{"$f":"_xludf.IFS(D7=\"\",\"\",D21>0,\"El valor estimado en la vigencia actual no corresponde con el presupuesto asignado, por favor valide la diferencia.\",D21=0,\"El PAA ha superado la prueba de validación\",D21<0,\"El valor estimado en la vigencia actual no corresponde con el presupuesto asignado, por favor valide la diferencia.\")","v":{"$error":"#NAME?"}}]
[null,null,"Valor total de las adquisiciones del planificadas",{"$f":"+SUM(Q25:Q510)","v":0}]
[null,null,"Valor total aprobado para el proyecto de inversión",{"$f":"IFERROR(IF(D7=\"\",0,(IF(D7=\"Funcionamiento\",0,VLOOKUP($D$15,LISTAS!D44:E53,2,0)))),\"\")","v":0}]
[null,null,"Diferencia entre los valor de las adquisiciones planeadas y aprobados",{"$f":"IFERROR(IF(D7=\"Funcionamiento\",0,(D19-(SUM(Q25:Q510)))),\"\")","v":0},null,null,null,null,null,null,null,null,null,null,null,null,null,null,null,null,null,null,null,"Registro - distribución mensual de compromisos y obligaciones ",null,null,null,null,null,null,null,null,null,null,null,null,null,null,null,null,null,null,null,null,null,null,null,null,"Validadores totales"]
[null,null,null,null,null,null,null,null,null,null,null,null,null,null,null,null,null,null,null,null,null,null,null,"Enero",null,"Febrero",null,"Marzo",null,"Abril",null,"Mayo",null,"Junio",null,"Julio",null,"Agosto",null,"Septiembre",null,"Octubre",null,"Noviembre",null,"Diciembre"]
["Ítem","Objetivo Específico del Proyecto de Inversión","Producto del Proyecto de Inversión","Actividad del Proyecto de Inversión","Códigos UNSPSC","Rubro prespuestal","Tipología de la adquisición","Descripción u objeto contractual","Mes estimado de inicio de proceso de selección","Mes estimado de presentación de ofertas","Mes de registro del contrato","Duración estimada del contrato",null,"Modalidad de selección ","Fuente de los recursos","Valor total estimado","Valor estimado en la vigencia actual","¿Se requieren vigencias futuras?","Estado de solicitud de vigencias futuras","Nombre del responsable","Cargo del responsable ","Teléfono del responsable ","Correo electrónico del responsable","Compromisos ","Obligaciones","Compromisos ","Obligaciones","Compromisos ","Obligaciones","Compromisos ","Obligaciones","Compromisos ","Obligaciones","Compromisos ","Obligaciones","Compromisos ","Obligaciones","Compromisos ","Obligaciones","Compromisos ","Obligaciones","Compromisos ","Obligaciones","Compromisos ","Obligaciones","Compromisos ","Obligaciones",null,"Compromisos ","Obligaciones"]
[null,null,null,null,null,null,null,null,null,null,null,"Duración","Unidad de tiempo"]
[null,null,null,null,null,null,null,null,null,null,null,null,null,null,null,null,null,null,null,null,null,null,null,null,null,null,null,null,null,null,null,null,null,null,null,null,null,null,null,null,null,null,null,null,null,null,null,null,{"$f":"IF(Q25-X25-Z25-AB25-AD25-AF25-AH25-AJ25-AL25-AN25-AP25-AR25-AT25=0,\"OK\",\"Compromisos diferentes al valor estimado en la vigencia actual\")","v":"OK"},{"$f":"IF(Q25-Y25-AA25-AC25-AE25-AG25-AI25-AK25-AM25-AO25-AQ25-AS25-AU25=0,\"OK\",\"Obligaciones diferentes al valor estimado en la vigencia actual\")","v":"OK"}]
[null,null,null,null,null,null,null,null,null,null,null,null,null,null,null,null,null,null,null,null,null,null,null,null,null,null,null,null,null,null,null,null,null,null,null,null,null,null,null,null,null,null,null,null,null,null,null,null,{"$f":"IF(Q26-X26-Z26-AB26-AD26-AF26-AH26-AJ26-AL26-AN26-AP26-AR26-AT26=0,\"OK\",\"Compromisos diferentes al valor estimado en la vigencia actual\")","v":"OK"},{"$f":"IF(Q26-Y26-AA26-AC26-AE26-AG26-AI26-AK26-AM26-AO26-AQ26-AS26-AU26=0,\"OK\",\"Obligaciones diferentes al valor estimado en la vigencia actual\")","v":"OK"}]
[null,null,null,null,null,null,null,null,null,null,null,null,null,null,null,null,null,null,null,null,null,null,null,null,null,null,null,null,null,null,null,null,null,null,null,null,null,null,null,null,null,null,null,null,null,null,null,null,"OK","OK"]
[null,null,null,null,null,null,null,null,null,null,null,null,null,null,null,null,null,null,null,null,null,null,null,null,null,null,null,null,null,null,null,null,null,null,null,null,null,null,null,null,null,null,null,null,null,null,null,null,"OK","OK"]
[null,null,null,null,null,null,null,null,null,null,null,null,null,null,null,null,null,null,null,null,null,null,null,null,null,null,null,null,null,null,null,null,null,null,null,null,null,null,null,null,null,null,null,null,null,null,null,null,"OK","OK"]
[null,null,null,null,null,null,null,null,null,null,null,null,null,null,null,null,null,null,null,null,null,null,null,null,null,null,null,null,null,null,null,null,null,null,null,null,null,null,null,null,null,null,null,null,null,null,null,null,"OK","OK"]
[null,null,null,null,null,null,null,null,null,null,null,null,null,null,null,null,null,null,null,null,null,null,null,null,null,null,null,null,null,null,null,null,null,null,null,null,null,null,null,null,null,null,null,null,null,null,null,null,"OK","OK"]
[null,null,null,null,null,null,null,null,null,null,null,null,null,null,null,null,null,null,null,null,null,null,null,null,null,null,null,null,null,null,null,null,null,null,null,null,null,null,null,null,null,null,null,null,null,null,null,null,"OK","OK"]
[null,null,null,null,null,null,null,null,null,null,null,null,null,null,null,null,null,null,null,null,null,null,null,null,null,null,null,null,null,null,null,null,null,null,null,null,null,null,null,null,null,null,null,null,null,null,null,null,"OK","OK"]
[null,null,null,null,null,null,null,null,null,null,null,null,null,null,null,null,null,null,null,null,null,null,null,null,null,null,null,null,null,null,null,null,null,null,null,null,null,null,null,null,null,null,null,null,null,null,null,null,"OK","OK"]
[null,null,null,null,null,null,null,null,null,null,null,null,null,null,null,null,null,null,null,null,null,null,null,null,null,null,null,null,null,null,null,null,null,null,null,null,null,null,null,null,null,null,null,null,null,null,null,null,"OK","OK"]
[null,null,null,null,null,null,null,null,null,null,null,null,null,null,null,null,null,null,null,null,null,null,null,null,null,null,null,null,null,null,null,null,null,null,null,null,null,null,null,null,null,null,null,null,null,null,null,null,"OK","OK"]
[null,null,null,null,null,null,null,null,null,null,null,null,null,null,null,null,null,null,null,null,null,null,null,null,null,null,null,null,null,null,null,null,null,null,null,null,null,null,null,null,null,null,null,null,null,null,null,null,"OK","OK"]
[null,null,null,null,null,null,null,null,null,null,null,null,null,null,null,null,null,null,null,null,null,null,null,null,null,null,null,null,null,null,null,null,null,null,null,null,null,null,null,null,null,null,null,null,null,null,null,null,"OK","OK"]
[null,null,null,null,null,null,null,null,null,null,null,null,null,null,null,null,null,null,null,null,null,null,null,null,null,null,null,null,null,null,null,null,null,null,null,null,null,null,null,null,null,null,null,null,null,null,null,null,"OK","OK"]
[null,null,null,null,null,null,null,null,null,null,null,null,null,null,null,null,null,null,null,null,null,null,null,null,null,null,null,null,null,null,null,null,null,null,null,null,null,null,null,null,null,null,null,null,null,null,null,null,"OK","OK"]
[null,null,null,null,null,null,null,null,null,null,null,null,null,null,null,null,null,null,null,null,null,null,null,null,null,null,null,null,null,null,null,null,null,null,null,null,null,null,null,null,null,null,null,null,null,null,null,null,"OK","OK"]
[null,null,null,null,null,null,null,null,null,null,null,null,null,null,null,null,null,null,null,null,null,null,null,null,null,null,null,null,null,null,null,null,null,null,null,null,null,null,null,null,null,null,null,null,null,null,null,null,"OK","OK"]
[null,null,null,null,null,null,null,null,null,null,null,null,null,null,null,null,null,null,null,null,null,null,null,null,null,null,null,null,null,null,null,null,null,null,null,null,null,null,null,null,null,null,null,null,null,null,null,null,"OK","OK"]
[null,null,null,null,null,null,null,null,null,null,null,null,null,null,null,null,null,null,null,null,null,null,null,null,null,null,null,null,null,null,null,null,null,null,null,null,null,null,null,null,null,null,null,null,null,null,null,null,"OK","OK"]
[null,null,null,null,null,null,null,null,null,null,null,null,null,null,null,null,null,null,null,null,null,null,null,null,null,null,null,null,null,null,null,null,null,null,null,null,null,null,null,null,null,null,null,null,null,null,null,null,"OK","OK"]
[null,null,null,null,null,null,null,null,null,null,null,null,null,null,null,null,null,null,null,null,null,null,null,null,null,null,null,null,null,null,null,null,null,null,null,null,null,null,null,null,null,null,null,null,null,null,null,null,"OK","OK"]
[null,null,null,null,null,null,null,null,null,null,null,null,null,null,null,null,null,null,null,null,null,null,null,null,null,null,null,null,null,null,null,null,null,null,null,null,null,null,null,null,null,null,null,null,null,null,null,null,"OK","OK"]
[null,null,null,null,null,null,null,null,null,null,null,null,null,null,null,null,null,null,null,null,null,null,null,null,null,null,null,null,null,null,null,null,null,null,null,null,null,null,null,null,null,null,null,null,null,null,null,null,"OK","OK"]
[null,null,null,null,null,null,null,null,null,null,null,null,null,null,null,null,null,null,null,null,null,null,null,null,null,null,null,null,null,null,null,null,null,null,null,null,null,null,null,null,null,null,null,null,null,null,null,null,"OK","OK"]
[null,null,null,null,null,null,null,null,null,null,null,null,null,null,null,null,null,null,null,null,null,null,null,null,null,null,null,null,null,null,null,null,null,null,null,null,null,null,null,null,null,null,null,null,null,null,null,null,"OK","OK"]
[null,null,null,null,null,null,null,null,null,null,null,null,null,null,null,null,null,null,null,null,null,null,null,null,null,null,null,null,null,null,null,null,null,null,null,null,null,null,null,null,null,null,null,null,null,null,null,null,"OK","OK"]
[null,null,null,null,null,null,null,null,null,null,null,null,null,null,null,null,null,null,null,null,null,null,null,null,null,null,null,null,null,null,null,null,null,null,null,null,null,null,null,null,null,null,null,null,null,null,null,null,"OK","OK"]
[null,null,null,null,null,null,null,null,null,null,null,null,null,null,null,null,null,null,null,null,null,null,null,null,null,null,null,null,null,null,null,null,null,null,null,null,null,null,null,null,null,null,null,null,null,null,null,null,"OK","OK"]
[null,null,null,null,null,null,null,null,null,null,null,null,null,null,null,null,null,null,null,null,null,null,null,null,null,null,null,null,null,null,null,null,null,null,null,null,null,null,null,null,null,null,null,null,null,null,null,null,"OK","OK"]
[null,null,null,null,null,null,null,null,null,null,null,null,null,null,null,null,null,null,null,null,null,null,null,null,null,null,null,null,null,null,null,null,null,null,null,null,null,null,null,null,null,null,null,null,null,null,null,null,"OK","OK"]
[null,null,null,null,null,null,null,null,null,null,null,null,null,null,null,null,null,null,null,null,null,null,null,null,null,null,null,null,null,null,null,null,null,null,null,null,null,null,null,null,null,null,null,null,null,null,null,null,"OK","OK"]
[null,null,null,null,null,null,null,null,null,null,null,null,null,null,null,null,null,null,null,null,null,null,null,null,null,null,null,null,null,null,null,null,null,null,null,null,null,null,null,null,null,null,null,null,null,null,null,null,"OK","OK"]
[null,null,null,null,null,null,null,null,null,null,null,null,null,null,null,null,null,null,null,null,null,null,null,null,null,null,null,null,null,null,null,null,null,null,null,null,null,null,null,null,null,null,null,null,null,null,null,null,"OK","OK"]
[null,null,null,null,null,null,null,null,null,null,null,null,null,null,null,null,null,null,null,null,null,null,null,null,null,null,null,null,null,null,null,null,null,null,null,null,null,null,null,null,null,null,null,null,null,null,null,null,"OK","OK"]
[null,null,null,null,null,null,null,null,null,null,null,null,null,null,null,null,null,null,null,null,null,null,null,null,null,null,null,null,null,null,null,null,null,null,null,null,null,null,null,null,null,null,null,null,null,null,null,null,"OK","OK"]
{"$rows_left_out":451}
{"sheet":"LISTAS","index":1,"n_rows":377,"n_cols":13,"rows_kept":377,"cut":false,"hidden":false,"merged":[[34,1,34,2],[40,1,41,1],[266,2,266,4],[266,5,266,7],[344,3,345,3],[27,1,27,2],[33,1,33,2],[1,1,1,2],[2,1,2,2],[19,1,19,2],[20,1,20,2],[26,1,26,2]]}
[]
[null,"Lista 2",null,null,null,"Funcionamiento","Inversión","INDIRECTO",null,"Tipo de Recurso"]
[null,"Modalidad_de_selección ",null,"Meses ",2023,"SECRETARÍA GENERAL","OFICINA DE GESTIÓN DE PROYECTOS DE FONDOS",{"$f":"FORMATO!D7","v":0},null,"Propios - 20 - Ingresos corrientes"]
[null,"CCE-11||03","Contratación régimen especial - Régimen especial","Enero ",2024,"SUBDIRECCIÓN DE DEMANDA","SUBDIRECCIÓN DE ENERGÍA ELÉCTRICA",null,null,"Propios - 21 - Otros recursos de tesorería"]
[null,"CCE-15||03","Contratación régimen especial (con ofertas)  - Régimen especial","Febrero",2025,"OFICINA DE TECNOLOGÍAS DE LA INFORMACIÓN","SUBDIRECCIÓN DE HIDROCARBUROS"]
[null,"CCE-99","Seléccion abreviada - acuerdo marco","Marzo",2026,"GIT GESTIÓN ADMINISTRATIVA Y SERVICIO AL CIUDADANO","SUBDIRECCIÓN DE DEMANDA"]
[null,"CCE-16","Contratación directa - Contratos interadministrativos ","Abril",null,null,"SUBDIRECCIÓN DE MINERÍA"]
[null,"CCE-16","Contratación directa - Prestación de servicios profesionales ","Mayo",null,null,"OFICINA DE TECNOLOGÍAS DE LA INFORMACIÓN"]
[null,"CCE-16","Contratación directa - Contratos de arrendamiento o adquisición de inmuebles","Junio",null,null,"SECRETARÍA GENERAL"]
[null,"CCE-16","Contratación directa - Contratos menor cuantía","Julio",null,null,"OFICINA ASESORA DE PLANEACIÓN"]
[null,"CCE-16","Contratación directa  - único oferente","Agosto",null,null,"DIRECCIÓN GENERAL - ENFOQUE TERRITORIAL"]
[null,null,null,"Septiembre",null,null,"SUBDIRECCIÓN DE GESTIÓN DE LA INFORMACIÓN"]
[null,null,null,"Octubre",null,null,null,null,null,null,"Rubro presupuestal"]
[null,null,null,"Noviembre",null,null,null,null,null,null,"A-02-01-01-004-005 MAQUINARIA DE OFICINA, CONTABILIDAD E INFORMÁTICA"]
[null,null,null,"Diciembre",null,null,null,null,null,null,"A-02-02-01-002-008 DOTACIÓN (PRENDAS DE VESTIR Y CALZADO)"]
[null,null,null,null,null,null,null,null,null,null,"A-02-02-01-003 OTROS BIENES TRANSPORTABLES (EXCEPTO PRODUCTOS METÁLICOS, MAQUINARIA Y EQUIPO)"]
[null,null,null,null,null,null,null,null,null,null,"A-02-02-01-003-002 PASTA O PULPA, PAPEL Y PRODUCTOS DE PAPEL; IMPRESOS Y ARTÍCULOS RELACIONADOS"]
[null,null,null,null,null,null,null,null,null,null,"A-02-02-01-003-005 OTROS PRODUCTOS QUÍMICOS; FIBRAS ARTIFICIALES (O FIBRAS INDUSTRIALES HECHAS POR EL HOMBRE)"]
[null,null,null,null,null,null,null,null,null,null,"A-02-02-01-003-008 OTROS BIENES TRANSPORTABLES N.C.P."]
[null,"Lista 3",null,null,null,null,null,null,null,null,"A-02-02-02-006-003 ALOJAMIENTO; SERVICIOS DE SUMINISTROS DE COMIDAS Y BEBIDAS"]
[null,"Fuente_de_los_recursos",null,"Unidad de tiempo",null,null,null,null,null,null,"A-02-02-02-006-004 SERVICIOS DE TRANSPORTE DE PASAJEROS"]
[null,0,"Propios - 20 - Ingresos corrientes","Meses",null,null,null,null,null,null,"A-02-02-02-006-007 SERVICIOS DE APOYO AL TRANSPORTE"]
[null,0,"Propios - 21 - Otros recursos de tesorería","Días",null,null,null,null,null,null,"A-02-02-02-006-008 SERVICIOS POSTALES Y DE MENSAJERÍA"]
[null,1,"Nación - 10 - Recursos Corrientes",null,null,null,null,null,null,null,"A-02-02-02-007-001 SERVICIOS FINANCIEROS Y SERVICIOS CONEXOS"]
[null,1,"Nación - 11 - Otros Recursos del Tesoro",null,null,null,null,null,null,null,"A-02-02-02-007-003 SERVICIOS DE ARRENDAMIENTO O ALQUILER SIN OPERARIO"]
[null,null,null,null,null,null,null,null,null,null,"A-02-02-02-008-002 SERVICIOS JURÍDICOS Y CONTABLES"]
[null,"Lista 4",null,null,null,null,null,null,null,null,"A-02-02-02-008-003 OTROS SERVICIOS PROFESIONALES, CIENTÍFICOS Y TÉCNICOS"]
[null,"¿Se requieren vigencias futuras?",null,null,null,null,null,null,null,null,"A-02-02-02-008-004 SERVICIOS DE TELECOMUNICACIONES, TRANSMISIÓN Y SUMINISTRO DE INFORMACIÓN"]
[null,"0","No",null,null,null,null,null,null,null,"A-02-02-02-008-005 SERVICIOS DE SOPORTE"]
[null,"1","Si",null,null,null,null,null,null,null,"A-02-02-02-008-007 SERVICIOS DE MANTENIMIENTO, REPARACIÓN E INSTALACIÓN (EXCEPTO SERVICIOS DE CONSTRUCCIÓN)"]
[null,"0","N/A",null,null,null,null,null,null,null,"A-02-02-02-008-009 OTROS SERVICIOS DE FABRICACIÓN; SERVICIOS DE EDICIÓN, IMPRESIÓN Y REPRODUCCIÓN; SERVICIOS DE RECUPERACIÓN DE MATERIALES"]
[null,null,null,null,null,null,null,null,null,null,"A-02-02-02-009-003 SERVICIOS PARA EL CUIDADO DE LA SALUD HUMANA Y SERVICIOS SOCIALES"]
[null,null,null,null,null,null,null,null,null,null,"A-02-02-02-009-006 SERVICIOS DE ESPARCIMIENTO, CULTURALES Y DEPORTIVOS"]
[null,"Lista 5",null,null,null,null,null,null,null,null,"A-02-02-02-009-007 OTROS SERVICIOS"]
[null,"Estado_de_solicitud_de_vigencias_futuras",null,null,null,null,null,null,null,null,"A-05-01-02-007-001 SERVICIOS FINANCIEROS Y SERVICIOS CONEXOS"]
[null,0,"N/A",null,null,null,null,null,null,null,"A-05-01-02-007-003 SERVICIOS DE ARRENDAMIENTO O ALQUILER SIN OPERARIO"]
[null,1,"No solicitadas",null,null,null,null,null,null,null,"A-05-01-02-008-003 OTROS SERVICIOS PROFESIONALES, CIENTÍFICOS Y TÉCNICOS"]
[null,2,"Solicitadas"]
[null,3,"Aprobadas"]
[]
[]
[]
["Reponsable","Nombre_del_Proyecto","Objetivo_General_Proyecto","Código_pptal","Total"]
["OFICINA DE GESTIÓN DE PROYECTOS DE FONDOS","Mejoramiento de la participación ciudadana en el modelo energético y de infraestructura energética, en el marco de la transición energética justa a nivel  nacional","Incrementar la participación de los usuarios en el desarrollo del modelo energético y de la infraestructura energética.","C-2102-1900-5",1500000000]
["SUBDIRECCIÓN DE ENERGÍA ELÉCTRICA","Fortalecimiento de la planeación para reducir las limitaciones en la prestación del servicio de energía eléctrica y la atención plena de la demanda nacional.","Reducir desde el planeamiento las limitaciones en la prestación del servicio de energía eléctrica en el territorio nacional.","C-2102-1900-6",5500000000]
["SUBDIRECCIÓN DE HIDROCARBUROS","Mejoramiento de la planeación del abastecimiento y confiabilidad del subsector de hidrocarburos a nivel nacional","Mitigar las restricciones en el abastecimiento de hidrocarburos.","C-2103-1900-2",2800000000]
["SUBDIRECCIÓN DE DEMANDA","Fortalecimiento del sector en la planificación de la atención de la demanda energética nacional y la transición energética justa a nivel nacional","Fortalecer al sector energético en la planificación de la atención de la demanda energética nacional y la transición energética justa.","C-2106-1900-13",4037375584]
["SUBDIRECCIÓN DE MINERÍA","Fortalecimiento de la planeación para el desarrollo minero responsable con los territorios en el marco de la transición energética a nivel nacional","Optimizar la planeación para el desarrollo minero responsable con los territorios en el marco de la transición energética.","C-2106-1900-12",2000000000]
["OFICINA DE TECNOLOGÍAS DE LA INFORMACIÓN","Fortalecimiento de los servicios digitales aumentando la capacidad para la transformación digital e interacción con el ciudadano","Fortalecer la interaccion y empoderamiento ciudadano a traves de la habilitacion de servicios digitales ","C-2199 1900-5",3896327879]
["SECRETARÍA GENERAL","Fortalecimiento de la percepción de la ciudadanía frente a los productos y servicios prestados por la UPME nacional","Aumentar la percepcion de la ciudadania frente a los productos y servicios prestados por la UPME","C-2199 1900-4",2271913289]
["OFICINA ASESORA DE PLANEACIÓN","Fortalecimiento de la percepción de la ciudadanía frente a los productos y servicios prestados por la UPME nacional","Aumentar la percepcion de la ciudadania frente a los productos y servicios prestados por la UPME","C-2199 1900-4",2271913289]
["DIRECCIÓN GENERAL - ENFOQUE TERRITORIAL","Fortalecimiento del levantamiento, gestión y apropiación de la información para la planeación del sector minero energético con enfoque territorial nacional","Fortalecer el uso de la informacion territorial en las dinamicas de la planeacion del sector mineroenergetico.","C-2106-1900-10",3262624416]
["SUBDIRECCIÓN DE GESTIÓN DE LA INFORMACIÓN","Fortalecimiento de la gestión de la información para la planeación del sector minero-energético a nivel nacional","Fortalecer el conocimiento, acceso y uso de la información del sector minero-energético por parte de la ciudadanía.","C-2106-1900-11",1900000000]
["TOTAL",null,null,null,{"$f":"SUM(E44:E53)","v":29440154457}]
[]
[]
[]
[]
[]
[null,null,null,null,null,null,null,null,null,null,"FORMULA PARA INDIRECTO PRY.INV"]
{"$rows_left_out":317}